AXI写通道死锁是我在SoC验证和总线调试工作中遇到最多的“程序上机时完全正常、跑到随机回归就挂死”的一类问题,而AW-W依赖造成的死锁,又是里面最容易被误判成“难道是DMA没配好”的坑。写地址通道AW和写数据通道W在协议上本来就是完全独立的两个通道,这种独立性给了设计很大的灵活性,但也埋下了互等死锁的隐患。如果你搞过AXI互联(NIC/Interconnect)的实现,或者写过基于AXI的master/slave验证环境,下面这个场景你大概率能对上号。

先说清楚一件事情:AXI协议本身并没有严格规定AW和W必须先到谁后到谁,对于单笔写事务,AXI只规定地址通道与数据通道的握手可以乱序完成,但最终必须汇聚到同一笔写数据。这个“允许乱序”加上“最终要汇聚”的边界条件,是所有AW-W依赖死锁的温床。如果不理解的读者可以这么想:AW好比快递单,W好比快递包裹,协议允许包裹先到门口、单子后送到,也允许单子先签收、包裹还没到,但快递站最终得把单子和包裹对上号才能入库。问题来了——如果仓库的入库规则是“必须同时看到单子和包裹才开始处理”,而快递员又坚持“你不收我的包裹,我就不给下一单的单子”,两边就僵住了。

我要在这篇文章里把AXI总线死锁的AW-W依赖场景彻底拆开:从协议层的逻辑推导,到互连实现里最容易出问题的buffer调度,再到实际波形上的判定方法,最后给出一套在验证阶段就能提前暴露这类死锁的配置方法。适合正在做AXI互联组件设计、总线功能模型(BFM)开发、或者做SoC级验证的朋友作为排查参考,也适合刚接触AXI协议但已经被黑盒挂死问题折磨得焦头烂额的验证工程师快速建立排查直觉。

1. 协议层面的死锁前置条件:理解AW与W通道的“伪独立”

1.1 为什么说“伪独立”

从AXI接口规范角度,AW通道和W通道是两条完全解耦的通道。AW通道有自己的VALID/READY握手,W通道也有自己的VALID/READY握手,两边各自做着自身的流量控制,互不感知对方的握手进度。这种设计初衷是为了同时利用地址通道的高效利用率(地址传输只需要几个周期)和数据通道的带宽占满(数据可以背靠背连续burst),从而提升总线利用率。

但在系统层面,AW和W并不是完全独立的,它们最终必须以某种形式绑定。最简单的绑定是写数据缓冲区的分配:master发出AW后,互连(interconnect)需要为这笔写事务分配一个数据缓冲槽位,后续W通道进来的数据写到这个槽位里。设计好一点的互联会在AW通道处理完、槽位分配好了之后,才向slave转发AW,同时把W通道的数据导向对应槽位。这种设计叫做“AW先仲裁并锁定资源”,是最常见的做法,因为它天然避免了W数据不知道往哪里写的尴尬。

问题恰恰出在这里:当互联采用“AW必须先于W成功传递”的内部策略时,整个写通道的行为就变成了一种串行依赖。一旦AW通道被某笔事务卡住,后续所有等待槽位的W数据都会被堵在互联的写入侧,哪怕slave的数据通道其实是空闲的。这时,如果卡住AW通道的“幕后黑手”是某个等待W通道完成的逻辑,真正的死锁就达成了。

1.2 从握手信号推导死锁的形成

我们缩小范围,只看一对着眼于slot分配的写数据通路。在音乐电路内部,通常有这样的处理:

  • AW FIFO先接收来自master的AW请求,解析出addr/len/id等信息。
  • 分配器根据AXI ID或者内部物理buffer索引,为这笔请求分配一个W buffer槽位。
  • 只有当槽位分配完成后,W通道的数据才允许被推入对应的buffer,否则WVALID会被内部反压拉低。

在这种结构下,AW和W之间产生了“实际上的先后依赖”。如果互连本身是直通的(pass-through),没有内部buffer,那么这个依赖依然存在——因为直通互连的W通道WREADY由下游slave决定,而下游slave如果采用“先收到AW、后收W”的处理模式(很多AXI slave都是这么写的,比如寄存器配置模块),那么W通道能否握手取决于AW是否已经往slave发送。这时候如果master发出的W比AW早,那么slave端根本看不到W的wready置高,W会一直阻塞。而如果master逻辑又要求“W全部写完后才允许释放AW通道”——逻辑上当然不会这么写,但实际中确实存在“W地址要由AW返回的数据计算得到”或“AW的突发长度要动态修改”这一类变态用法——两边就进入了教科书式的循环等待。

用严格的公式描述就是:

  • master等待:AW通道握手完成,才发出W数据(WVALID等待AWREADY)。
  • slave等待:W通道握手完成(收到全部写数据),才接受下一次AW。 这是一个经典的循环等待。而在AXI协议中,AW和W握手的完成顺序直接取决于对端逻辑,协议不会帮你打破这种循环,因此死锁成立。

1.3 最容易忽视的ID绑定陷阱

不少AXI master在发出写请求时,会用ID来标记不同的事务流。互连侧也根据ID维护事务顺序和写数据缓冲的归属。很多人以为ID不同的事务天然不会互相阻塞,实际上不然。当互连为每个ID维护独立的FIFO或buffer时,如果某个ID对应的W通道数据一直不出现,而这个ID又占着互连内部的物理buffer条目,那么其他ID的AW和W都可能因为没有空闲物理条目而被堵住。

这个场景在验证环境里极其隐蔽,尤其当你用AXI VIP同时发起多笔不同ID的写请求时,VIP不会出错,但是你的DUT就会因为ID映射表的表项被未完成的写事务占满而把新请求全部反压。如果此时DUT内部还有其他模块在等待被反压的那笔写事务完成后再释放这个ID,死锁闭环直接形成。

2. 实战中AW-W依赖死锁的典型场景拆解

2.1 场景一:写响应通道与数据通道的交叉等待

这是我实际调试SoC时碰到的最多的一种。系统包含一个CPU访问路径和一个DMA访问路径,两个master通过AXI互联访问同一个sram控制器。sram控制器是典型的“先收AW,再收W”的slave实现:AW通道到后分配地址访问权,W通道数据到后执行写操作。

DMA一般按block传输,AW和W的间隔很短,几乎同时到达互联。而互联是两级arbiter结构:第一级仲裁AW通道,第二级仲裁W通道,两级仲裁彼此独立。极端情况下,DMA的AW被第一级仲裁选中,wreq正常发出;但DMA的W通道在第二级仲裁时输给了CPU的高优先级W请求,被堵住了。

正常情况这没问题,因为sram控制器还在处理之前的事务,等到CPU的W传输完成后,DMA的W就能继续。问题出在设置了超时保护机制的情况下:sram控制器发现DMA的AW已经到达但W长时间未到,按照某些低功耗或安全策略,会将这笔AW标记为超时并丢弃,同时向DMA返回一个错误响应。DMA收到错误响应后,会尝试通过软件中断通知CPU执行错误恢复。而CPU的错误恢复程序需要重新配置DMA,这又需要先完成一个写配置寄存器的动作,这个写配置又走CPU的master接口……此时,如果配置寄存器所在的slave恰好就是被DMA事务占用了那个sram控制器,而sram控制器的超时丢弃逻辑还在等待CPU事务完成,一个跨master的死锁就出现了。

这个场景让人崩溃的地方在于:它和AXI协议本身无关,完全是系统级交互策略惹的祸。但总线上的表现就是AW和W两个通道各自被卡住,你抓波形只能看到CPU的WREADY一直为低,DMA的AWREADY也一直为低。

2.2 场景二:写数据缓冲深度不足导致的倒灌死锁

另一种常见场景是:互连内部为写数据分配的FIFO深度是固定的,比如每个ID支持4个写数据条目。master发出一笔burst长度为16的写事务,W通道会连续16拍传输。由于AW已经发出,FIFO条目仅分配了一个(某些互联为了提高吞吐会一次性分配足够所有burst的数据条目,但做节省面积设计的互联不会这么做)。

如果这个FIFO的处理逻辑是“只有收到WLAST才释放条目”,当burst数据超过条目深度时,后端的slave来不及接收(比如slave本身处理速度慢),FIFO在4拍后就满了,WVALID被拉低。master的W通道被反压。看起来这只是背压,不会死锁。

但如果此时interconnect中还有其他master,例如一个gpio模块,向同一个slave发起一笔短的写请求。gpio请求的AW在仲裁中排在前面,先获得了内部地址通道的授权并分配到一个新的FIFO条目(因为FIFO是按ID拆分的,gpio的ID不同,有独立条目,所以分配成功)。gpio的W数据立即被接收。slave可能采用了“本轮写完才收下一笔”的顺序处理机制,导致它要等长burst那一笔结束后才开始处理gpio的短事务。但长burst那笔的剩余数据又因为FIFO满了而无法进入……最终,gpio的短事务完成后释放了它自己的条目,长burst所在master被反压在FIFO满状态,而slave被那笔永远等不到剩余数据的AW锁住,两个master被卡死在一个跨ID的依赖关系里。

这种场景的判定难点在于:看起来像slave吞吐不足的背压问题,实际是互联FIFO分配策略与slave处理策略的交互产生了典型闭环。

2.3 场景三:AXI接口的地址数据通道乱序支持不完整

高端总线协议是明确支持outstanding和乱序完成的,也就是允许AW已经发送了多笔事务,W数据以任意顺序回到对应的ID流水线上。但如果互联实现时对乱序的支持“打了折扣”——比如只能支持“同一ID乱序完成”,不能跨ID乱序——情况就不一样了。

考虑一个互联采用write interleaving使能(W通道允许不同ID的写数据交叉传输)的设计。互联内部有按ID拆分的FIFO结构,支持WLAST之后立即释放条目,所以不同ID的事务在W通道上是交织的。然后一个slave的实现只接收了“AW必须按顺序处理,W数据可以交织”的握手信号,ID上明明已经是交织到了不同ID事务,slave却因为其内部维护了一个按顺序解析的逻辑,需要先把某个早期ID的AW处理完,才能接受这个ID的W数据,否则就把W通道反压。而这个早期ID的master已经把AW发出,等不到W服务导致该master的事务一直处于outstanding状态。

这个场景在IP验证中容易被环境掩盖,因为验证IP一般都在slave端做了完善的乱序支持,但真是集成到SoC中,遇到实际slave实现粗糙的情况就露馅了。

3. 怎么从波形与代码层面判定AW-W依赖死锁

3.1 用波形找出“谁在等谁”

死锁排查第一步,永远不是直接去看RTL代码,而是先把挂在总线上的所有master/slave端口波形拉出来,按下面的顺序依次检查:

  1. 对所有写事务,分别观测AW通道和W通道的VALID/READY信号,确认其各自停在什么状态。
  2. 记录每一个被拉高VALID但READY一直为低的主设备端口,以及每一个被拉高READY但VALID一直为低的从设备端口。
  3. 把主设备端口等待的对端信号归类——如果master A的AWVALID为高、AWREADY为低,同时master A的WVALID为高、WREADY为低,那它就是典型的“发着AW和W,但两个通道都被卡住”的状态。
  4. 顺着这条路径,找到谁在拉低这些READY信号。通常会在某个slave的输入端口看到它已经接收了AW但没接收W,或者反过来。

另外务必观测信号:

  • AWID/AWADDR:确定当前被卡住的是哪笔事务。
  • WID/WLAST:确定W数据是否完整到达。
  • 互联内部buffer/counter的状态值:如果互联是代码可读的,直接看internal state寄存器。

关键判定方法很简单:如果master同时拉高AWVALID和WVALID(或先拉高AWVALID,后拉高WVALID),但AWREADY和WREADY双双保持低电平超过几百个时钟周期,且这段时间没有其他高优先级事务插入,那么基本可以锁定是一个跨通道相互等待的死锁。

3.2 通过协议违例检查器和形式化验证快速暴露问题

业界常用的SVTAXI VIP具备协议检查能力,它默认会检查协议规则,但对“AW和W的乱序程度”通常只是做协议层形的检查,不会深入到“两个通道是否最终能完成同一笔事务”的交错验证。因此你的验证环境里需要额外定制断言:

  • 断言1:对于每个有效的AW请求,在n个时钟周期内,必须出现对应的带WID匹配的W数据。
  • 断言2:对于每个有效的W数据,在m个时钟周期内,必须出现对应的AW已经有效或已被接受。
  • 断言3:若master在拉高AWVALID之后,WVALID也拉高,则两个通道必须在k个周期内同时完成握手并进入下一笔事务。

断言属性(以SVA为例可以写成):

property aw_w_data_handshake_dependency;
    @(posedge aclk) disable iff (!arstn)
    $rose(awvalid) && awready |-> ##[0:$] (wvalid && wready && wid == awid);
endproperty

这种断言在死锁发生的周期内会无限期等待,看起来是“失败挂起”,但配合 assert #0 或超时器能直接捕捉到“事务在经过可配置的最大延迟后仍未完成”的违规。

我更推荐的做法是在simulation环境中加入一个全局的看门狗超时检查器,以固定周期(比如100us)扫描所有AXI事务,只要发现有事务在超过最大延迟后仍未完成,就报FATAL并dump当时的波形。这个做法的好处是:即使你不清楚具体的死锁形成机理,也能在第一时间获得足够多的波形上下文,大幅度缩小定位范围。

3.3 用RTL静态检查反推设计策略

死锁问题在验证阶段发现后再去改设计,成本是很高的。最有效的方法其实是在设计阶段做一次静态“通道依赖”审查。方法很简单:把设计中所有跟AXI写通道有关的VALID/READY反压路径列出来,逐条问一下:

  • 这条路径上,某个信号是否在等待另一个通道的握手完成?
  • 是否存在“W通道的ready由‘AW已经被接收’这一条件门控”的情况?
  • 是否存在“AW通道的ready由‘当前写事务必须完成’这一条件门控”的情况?
  • 上述两个条件如果同时为真,死锁风险直接拉满。

例如slave逻辑中常见的写法是:

assign awready = (aw_fifo_not_full) && w_state == IDLE;
assign wready  = (w_fifo_not_full) && aw_received;

这一个代码片段,就同时包含了AW等待W完成(aw_fifo_not_full取决于W FIFO是否被读走)和W等待AW接收(wready取决于aw_received)两段依赖。如果设计里还有类似的cross-dependency,死锁几乎是纪律性会发生的事情。

4. 避免与修复AW-W依赖死锁的工程手段

4.1 对master侧:强制W通道与AW通道的发射顺序

若master本身是完整的AXI master设计,最简单也最稳妥的策略是:对单ID写事务,强制在WVALID为低时,不允许AWVALID被拉高;换句话说,必须先让W通道的数据准备好并成功发出,才允许AW通道的请求送到总线上。如果你觉得这样会影响性能(因为地址通道的效率会降低),你也可以退一步,允许AW先发,但保证在AW发出的同时,W数据必须在一个固定的小周期内准备好(例如最多延迟4个周期)。

这种“限定乱序窗口”的做法,在绝大多数实际设计中已经够用,因为死锁往往不是因为乱序本身,而是因为乱序的极端情况(比如AW发出后,W数据永远不来)被触发了。只要把极端情况用协议或实现堵死,就能大幅降低死锁概率。

4.2 对slave侧:不依赖通道间的时序关系

一个健壮的AXI slave绝对不能假设AW和W的到达顺序。即使你现在面对的master在功能仿真中总是先发AW后发W,也要考虑到真实互联中W可能提前到达(特别是当互连支持write data interleaving时)。建议的slave实现方案是:

  • 写数据通道自带独立的buffer/FIFO,能够缓存与地址通道解耦的W数据。
  • 只有当AW和W都齐了(通过ID匹配),才把事务交给内部处理逻辑。
  • 如果内部资源不足,需要反压时,永远不要让W通道的ready等待整个内部状态机回到IDLE,而是允许W数据进入buffer,但暂不启动内部操作;同时,AW通道的ready也仅取决于address buffer的剩余深度,不关心数据通道的状态。

这里我需要特别强调:很多初写AXI slave的工程师,会为了“逻辑简单”而把awready直接接到“当前状态机空闲”,wready直接接到“aw已经接收”,这在单master直连测试的时候完全正常,但在多master/多事务系统集成时就是定时炸弹。我见过不少死锁,最后定位下来就是slave端这个“为了图省事”的逻辑。

4.3 对互连侧:合理的仲裁优先级与缓冲分配策略

互连是AXI系统中产生AW-W死锁的核心地带。你可以从以下几个方面进行加固:

  • 保证AW通道仲裁与W通道仲裁的一致性:即如果某个master的AW被选中,那么它的W通道也应该获得对应的优先权,避免出现“AW已经过去,W遥遥无期”的长期等待。
  • 为每个ID/每个master提供足够深度的W数据缓冲,并确保缓冲条目在事务完成(收到WLAST并转发给slave)时及时释放,不能把释放条件跟slave响应强绑定。若必须绑定,需要额外考虑可能出现响应延迟的情况。
  • 对W通道采用老化(aging)机制,防止某个低优先级master的W通道被高优先级master的连续事务“饿死”,饿死本质上不是死锁,但饿死的表现和死锁几乎一样。

还有一个容易被忽略的点:互连的AXI ID映射。多主多从互连一般会为每个master分配独立的ID slice,但如果设计中存在对ID的“重映射”,务必确认重映射逻辑不会把两笔不同master但相同ID的事务合并到同一个buffer条目里。我踩过一次坑:互连为减少资源消耗,将master A的ID 0和master B的ID 0映射到了同一个内部ID 0,事务本来可以交错进行,结果却在W通道的FIFO上完全串行化,而串行化的顺序是随机的,导致偶发性的跨master死锁。

5. 我摸过的几类典型挂在波形上的案例复盘

5.1 案例一:FPGA原型验证里CPU配置通路死锁

当时在FPGA原型上跑一个带DMA和CPU的子系统,启动自检时CPU要写一组DMA描述符。DMA引擎支持链表搬运,描述符里有“下一跳地址”字段,DMA自动读取描述符后搬数。死锁的现象是系统启动后,门狗复位无法解决,手动复位后仍复现。抓波形后观察到:

  • CPU的AWVALID一直为高,AWREADY一直为低。
  • CPU的WVALID一直为高,WREADY一直为低。
  • DMA的AWVALID为低(DMA所有通道空闲)。
  • 互联内部事务计数器显示有2笔写事务卡在翻译器里。

进一步排查发现:DMA自动搬运完第一段后,需要写一个中断状态寄存器。这个中断状态寄存器所在的模块,恰好就是CPU配置描述符所经过的同一个AXI bridge翻译器。而bridge翻译器的1写数据FIFO满了——里面装着CPU配置DMA描述符的数据。由于CPU的W数据没被收走,DMA的FIFO条目也不会释放,而DMA本身没有发新的AW,所以不是Master互抢,而是“互联被自己堵住”。原因是在验证过程中,DMA的W通道被CPU高优先级事务抢占了仲裁,CPU这一笔W又因为互联的FIFO满而反压,而互联的FIFO满是因为之前的CPU配置数据没有被读走。一环扣一环。

修复措施:把互联W数据FIFO的深度从8调整为16,同时调整仲裁优先级,让已经发出AW的master在W通道仲裁时获得一个较高的优先级。改完后连续跑了48小时的随机回归,再没复现过。

5.2 案例二:全互连乱序导致的事务ID倒挂

另一个案例是验证AXI高速桥接器(AXI-to-AHB bridge)时发现的。该桥接器把多个AXI master请求转换成AHB master请求,内部用了一个简单的round-robin仲裁。由于AHB的写事务是地址和数据在同一拍附近完成的(AHB不支持AW/W分离),桥接器必须在内部先把AXI的AW和W都接收齐了,才能发起AHB写。这个逻辑本身没问题,但桥接器对多个outstanding的AXI写事务使用了一个大FIFO来暂存。

问题来了:当master以相同ID连续发出两笔写事务时(AW0、AW1依次发出,W1的数据先于W0到达),桥接器内部FIFO的操作逻辑是先进先出的。它把W1先入队,W0后入队。由于ID相同,逻辑误以为W1是对应AW0的数据,结果发给AHB时数据错乱,错乱后的校验失败导致AHB返回ERROR,AXI master收到ERROR后开始重试,重试的事务和原本还在FIFO里的事务交织,最终把地址到数据的对齐逻辑搞崩溃,形成实际上的死锁。

这个问题的根源在于AXI的乱序是由ID区分的,如果设计内部不完整支持同一ID下多笔outstanding事务乱序完成,就必须设置ID约束,禁止同一ID的写数据严格按照地址顺序到达。修复方案是在桥接器入口加一个ID同序检查逻辑,如果检测到同一ID的AW顺序和W顺序不一致,就把W数据暂存到按AW顺序排列的显式对齐缓冲中,从而彻底消除倒挂风险。

5.3 案例三:IP集成中睡眠/唤醒导致的通道中断

最后一个案例比较冷门,但很有代表性。某个支持低功耗的互连IP,在检测到系统总线空闲后会触发睡眠请求,睡眠过程中会关闭部分通道时钟。它的判断条件是“所有master的AWVALID和WVALID都为低,且所有slave都返回完毕”。然而在多核处理器系统中,一个core的AWVALID为低、另一个core的WVALID为低,但互连内部还有未完成的写数据残留在中间FIFO里。总线空闲检测逻辑只看了端口信号,没看内部残留,于是决定睡觉。睡眠后,本来还有一笔小写操作要从A端口走到B端口,时钟一关,数据永远停在里面。系统醒来后,这笔事务永远不会被传送,而发起方core还在等它完成,最终挂死。

这种问题表面上跟AW-W依赖没什么关系——因为从端口上你看不到任何VALID/READY同时拉高的死锁状态——但它的本质依然是“写数据被缓存在中间节点,而地址通道的状态又让系统误判为所有工作已经完成”。我吃过的教训是:设计低功耗空闲检测逻辑时,必须把互连内部所有写缓冲器的空状态信号纳入判定条件,而不是只看端口握手信号。

6. 常见问题速查表与排查自检清单

为了方便你平时Debug时快速对照,我把常见的几种表现和对应可能原因整理成了一张速查表:

观测到的波形现象 可能原因 优先排查方向
同一master的AWVALID=1且WVALID=1,双READY均为0 slave或互连内部AW/W交叉等待 检查slave代码中awready和wready的条件
AW占着资源,W数据迟迟不出现,最终触发超时 master侧W生成逻辑延迟过大,或乱序窗口异常 检查master发W的时序与FIFO深度
不同master的AW都发出,W互相抢占导致某个W饿死 W通道仲裁策略无aging机制 给W仲裁增加优先级提升或轮换策略
系统级空闲检测触发睡眠后,恢复时事务不再继续 总线空闲判断未覆盖内部FIFO残留 检查低功耗判定条件是否包含busy状态信号
单ID连续两笔写事务,第二笔的W先到,导致数据错乱 桥接器内部没有按ID维护FIFO写入顺序 核对内部重排机制与ID同序约束
死锁只在长时间随机回归中偶现 设计存在极端乱序条件未覆盖,或缓冲深度不足 加大随机种子,加断言,用形式化验证扫交叉依赖

排查时我习惯按照下面的顺序过一遍,基本能覆盖绝大多数情况:

  1. 确认是否为真实死锁(所有相关信号停留超过可接受最大时长),还是仅仅长周期背压。
  2. 分别画出AW通道的依赖链和W通道的依赖链,找出两者的交汇点。
  3. 检查交汇点是否存在“等待对方通道事件”的逻辑。若有,确认是否有超时或旁路机制。
  4. 检查互联的写数据FIFO、条目分配和释放条件,确认是否与响应通道(B通道)强绑定。
  5. 检查所有握手的condition是否只用单一通道信号组合,未等待另一个通道信号;若有交叉等待,评估交叉范围是否具备“必然能解除”的单调性。
  6. 确认从端口到内部逻辑的时钟/复位关系一致,排除因低功耗时钟门控产生的伪死锁。

有些时候,死锁并不是单纯的总线问题,而是协议违例问题——比如master违反了WLAST的时序,导致slave永远等不到burst结束。所以排查时别忘了检查WLAST是否有效,这是很容易被忽略的细节。一批burst的数据如果在中间断掉,WLAST永远不会来,slave的FIFO永远释放不了。

7. 验证阶段提前“引爆”AW-W死锁的配置方法

与其等死锁在SoC回归中偶现后痛苦定位,不如在验证阶段主动去制造触发条件。我建议在搭建AXI验证环境时,在master的BFM层面对AW和W的发射之间插入可控的随机延迟,覆盖面包括:

  • AW比W早0~N拍(N建议覆盖到大于FIFO深度)。
  • W比AW早0~N拍。
  • 同一ID的连续写事务中,AW顺序正常、W顺序打乱。
  • 不同ID的写事务W数据交织(write interleaving)。
  • 在半途将WVALID拉低数拍后再恢复,制造不完全流水线。

上述操作都能通过SystemVerilog的约束随机变量实现。你要做的是在BFM里把AW和W的发送流程分离,用两个独立的fork/join_none块分别驱动AWVALID和WVALID,但通过共享的事务队列来维护两者间的顺序关系。在调试模式下,你甚至可以在每次发送AW前固定插入一个while循环,等待某个内部debug信号,从而人为制造一个极长的AW延迟窗口,直接测试slave是否依赖AW先行的顺序。

如果你用的是商用AXI VIP(比如Synopsys或Cadence的VIP),一般都有专门的配置项来控制AW/W之间的delay,甚至支持“数据比地址先到”的非协议行为模拟。请务必在你的回归用例里把这些配置随机化,而不是只在默认的“地址先发,数据紧跟”模式下跑。很多死锁只有在你强迫总线上出现违反直觉的顺序时才会露出原形。

另外,一个实用的技巧是在RTL仿真环境中加入死锁检测模块(deadlock detector),它的原理很简单:对每个AXI端口维护一个计数器,每当检测到一次完整的事务(AWREADY&&AWVALID握手成功,且WREADY&&WVALID握手成功且WLAST为高),就对计数器清零;如果计数器超过某个阈值(比如10000个时钟周期)仍未清零,就报告FATAL。这个模块写起来很简单,但能在死锁发生的瞬间就dump出所有相关波形,而不是等到整个回归超时后才发现系统挂死。我认为这是投入产出比最高的一个验证增强手段。

我个人在实际项目里的体会是:AW-W依赖死锁最可怕的地方不是它有多难懂,而是它太容易在设计评审和功能仿真中被轻松跳过。因为单笔事务在简单的directed test下永远不会踩中时序交汇的雷区;只有当你把总线流量拉大、事务交织、缓冲深度逼近极限时,问题才会像潮水一样涌出来。所以如果你现在正被一个“偶尔挂死、复位就好、波形看不出明显问题”的AXI系统折腾,我强烈建议你先去翻一翻所有slave的awready/wready赋值逻辑,看看有没有交叉等待——这一眼可能就能省下你一个星期的排查时间。

Logo

北京人形旗下天工造物具身智能开源社区,聚焦具身天工与慧思开物两大平台

更多推荐