centos6.5 编译安装mariadb如遇到如下错误

collect2: ld returned 1 exit status

make[2]: *** [unittest/mysys/aes-t] Error 1
make[1]: *** [unittest/mysys/CMakeFiles/aes-t.dir/all] Error 2

make: *** [all] Error 2


解决方法:

查看cmake版本(cmake --version)

将2.6版本升级到2.8版本,重新cmake编译安装即可

Logo

北京人形旗下天工造物具身智能开源社区,聚焦具身天工与慧思开物两大平台

更多推荐